Target
Tryptophan 2,3-dioxygenase
Ligand
BDBM317217
Substrate
Meas. Tech.
Enzymatic TDO Assay
IC50
1000±n/a nM
Citation
 Kumar, SWaldo, JJaipuri, FMautino, M Tricyclic compounds as inhibitors of immunosuppression mediated by tryptophan metabolization US Patent  US9981973 Publication Date 5/29/2018 
Target
Name:
Tryptophan 2,3-dioxygenase
Synonyms:
T23O_HUMAN TDO2 TRPO Tryptophan oxygenase Tryptophanase
Type:
PROTEIN
Mol. Mass.:
47874.48
Organism:
Homo sapiens (Human)
Description:
ChEMBL_825691
Residue:
406
  
Inhibitor
Name:
BDBM317217
Synonyms:
US9617272, Compound 101 | US9981973, Compound 101
Type:
Small organic molecule
Emp. Form.:
C10H8N2
Mol. Mass.:
156.1839
SMILES:
C1c2cn[nH]c2-c2ccccc12
: