Target
Tyrosine-protein kinase Mer
Ligand
BDBM396992
Substrate
Meas. Tech.
Enzymatic Assay
IC50
<5±n/a nM
Citation
 Li, YWang, XHe, C Pyrrolotriazine compounds as tam inhibitors US Patent  US9981975 Publication Date 5/29/2018 
Target
Name:
Tyrosine-protein kinase Mer
Synonyms:
MER MERTK Proto-oncogene c-Mer Receptor tyrosine kinase MerTK | Tyrosine-protein kinase Mer
Type:
PROTEIN
Mol. Mass.:
110234.77
Organism:
Homo sapiens (Human)
Description:
ChEMBL_1498723
Residue:
999
  
Inhibitor
Name:
BDBM396992
Synonyms:
US10442810, Example 54 US11591338, Example 54 | US9981975, Example 54
Type:
Small organic molecule
Emp. Form.:
C31H30FN7O3
Mol. Mass.:
567.6134
SMILES:
Nc1ncnn2c(cc(-c3ccc(NC(=O)c4cccn(-c5ccccc5)c4=O)cc3F)c12)C1CCN(CCO)CC1
: