Target
Tyrosine-protein kinase receptor UFO
Ligand
BDBM397031
Substrate
Meas. Tech.
Autophosphorylation Assay
IC50
<5±n/a nM
Citation
 Li, YWang, XHe, C Pyrrolotriazine compounds as tam inhibitors US Patent  US9981975 Publication Date 5/29/2018 
Target
Name:
Tyrosine-protein kinase receptor UFO
Synonyms:
AXL TEL/AXL UFO | UFO_HUMAN
Type:
Enzyme
Mol. Mass.:
98316.97
Organism:
Homo sapiens (Human)
Description:
P30530
Residue:
894
  
Inhibitor
Name:
BDBM397031
Synonyms:
US10442810, Example 95 US11591338, Example 95 | US9981975, Example 95
Type:
Small organic molecule
Emp. Form.:
C31H32N8O4
Mol. Mass.:
580.637
SMILES:
CC(C)n1cc(C(=O)Nc2ccc(cc2)-c2cc(CN3CCOCC3)n3ncnc(N)c23)c(=O)n(-c2ccccc2)c1=O
: