Target
5-hydroxytryptamine receptor 2A
Ligand
BDBM397088
Substrate
Meas. Tech.
Radioligand Binding Assay
IC50
1.20±n/a nM
Citation
 Teegarden, BChapman, DChoi, JFeichtinger, KHan, SJayakumar, HTran, TXu, JZou, N Primary amines and derivitves thereof as modulators of the 5-HT2A serotonin receptor useful for the treatment of disorders related thereto US Patent  US9987252 Publication Date 6/5/2018 
Target
Name:
5-hydroxytryptamine receptor 2A
Synonyms:
5-HT-2 5-HT2A 5-hydroxytryptamine receptor 2A (5HT-2A) 5HT2A_HUMAN HTR2A | Serotonin receptor 2A
Type:
undefined
Mol. Mass.:
52607.65
Organism:
Homo sapiens (Human)
Description:
P28223
Residue:
471
  
Inhibitor
Name:
BDBM397088
Synonyms:
4-Bromo-thiophene-2- carboxylic acid [4-(2- amino-ethoxy)-3-(4- chloro-2-methyl-2H- pyrazol-3-yl)-phenyl]- amide | US9987252, 77
Type:
Small organic molecule
Emp. Form.:
C17H16BrClN4O2S
Mol. Mass.:
455.757
SMILES:
Cn1ncc(Cl)c1-c1cc(NC(=O)c2cc(Br)cs2)ccc1OCCN
: