Target
E3 ubiquitin-protein ligase Mdm2
Ligand
BDBM31228
Substrate
biotinylated IP3 peptide
Meas. Tech.
MDM2-p53 Interaction Using a 96-Well Plate Binding Assay (ELISA)
pH
7.4±n/a
Temperature
277.15±n/a K
IC50
90000±39000 nM
Citation
 Hardcastle, IRAhmed, SUAtkins, HFarnie, GGolding, BTGriffin, RJGuyenne, SHutton, CKällblad, PKemp, SJKitching, MSNewell, DRNorbedo, SNorthen, JSReid, RJSaravanan, KWillems, HMLunec, J Small-molecule inhibitors of the MDM2-p53 protein-protein interaction based on an isoindolinone scaffold. J Med Chem 49:6209-21 (2006)  
Target
Name:
E3 ubiquitin-protein ligase Mdm2
Synonyms:
Double minute 2 protein E3 ubiquitin-protein ligase Mdm2 (p53-binding protein Mdm2) Human Double Minute 2 (HDM2) MDM2-MDMX p53-Binding Protein MDM2 | p53-binding protein
Type:
Oncoprotein
Mol. Mass.:
55196.54
Organism:
Homo sapiens (Human)
Description:
Q00987
Residue:
491
  
Inhibitor
Name:
BDBM31228
Synonyms:
CHEMBL182052 | isoindolinone scaffold, 14
Type:
Small organic molecule
Emp. Form.:
C27H27NO5
Mol. Mass.:
445.507
SMILES:
CCCOC1(N(C(Cc2ccc(O)cc2)C(=O)OC)C(=O)c2ccccc12)c1ccccc1
:
Substrate
Name:
biotinylated IP3 peptide
Synonyms:
b-IP3
Type:
Peptide
Mol. Mass.:
4116.56
Organism:
Description:
Residue:
37