Target
E3 ubiquitin-protein ligase Mdm2
Ligand
BDBM31232
Substrate
biotinylated IP3 peptide
Meas. Tech.
MDM2-p53 Interaction Using a 96-Well Plate Binding Assay (ELISA)
pH
7.4±n/a
Temperature
277.15±n/a K
IC50
70000±8000 nM
Citation
 Hardcastle, IRAhmed, SUAtkins, HFarnie, GGolding, BTGriffin, RJGuyenne, SHutton, CKällblad, PKemp, SJKitching, MSNewell, DRNorbedo, SNorthen, JSReid, RJSaravanan, KWillems, HMLunec, J Small-molecule inhibitors of the MDM2-p53 protein-protein interaction based on an isoindolinone scaffold. J Med Chem 49:6209-21 (2006)  
Target
Name:
E3 ubiquitin-protein ligase Mdm2
Synonyms:
Double minute 2 protein E3 ubiquitin-protein ligase Mdm2 (p53-binding protein Mdm2) Human Double Minute 2 (HDM2) MDM2-MDMX p53-Binding Protein MDM2 | p53-binding protein
Type:
Oncoprotein
Mol. Mass.:
55196.54
Organism:
Homo sapiens (Human)
Description:
Q00987
Residue:
491
  
Inhibitor
Name:
BDBM31232
Synonyms:
CHEMBL179114 | isoindolinone scaffold, 18
Type:
Small organic molecule
Emp. Form.:
C30H28N2O3
Mol. Mass.:
464.5549
SMILES:
COc1ccc(cc1)C(O)CNC1(N(Cc2ccccc2)C(=O)c2ccccc12)c1ccccc1
:
Substrate
Name:
biotinylated IP3 peptide
Synonyms:
b-IP3
Type:
Peptide
Mol. Mass.:
4116.56
Organism:
Description:
Residue:
37