Target
E3 ubiquitin-protein ligase Mdm2
Ligand
BDBM31247
Substrate
biotinylated IP3 peptide
Meas. Tech.
MDM2-p53 Interaction Using a 96-Well Plate Binding Assay (ELISA)
pH
7.4±n/a
Temperature
277.15±n/a K
IC50
116000±20000 nM
Citation
 Hardcastle, IRAhmed, SUAtkins, HFarnie, GGolding, BTGriffin, RJGuyenne, SHutton, CKällblad, PKemp, SJKitching, MSNewell, DRNorbedo, SNorthen, JSReid, RJSaravanan, KWillems, HMLunec, J Small-molecule inhibitors of the MDM2-p53 protein-protein interaction based on an isoindolinone scaffold. J Med Chem 49:6209-21 (2006)  
Target
Name:
E3 ubiquitin-protein ligase Mdm2
Synonyms:
Double minute 2 protein E3 ubiquitin-protein ligase Mdm2 (p53-binding protein Mdm2) Human Double Minute 2 (HDM2) MDM2-MDMX p53-Binding Protein MDM2 | p53-binding protein
Type:
Oncoprotein
Mol. Mass.:
55196.54
Organism:
Homo sapiens (Human)
Description:
Q00987
Residue:
491
  
Inhibitor
Name:
BDBM31247
Synonyms:
isoindolinone scaffold, 36
Type:
Small organic molecule
Emp. Form.:
C29H26N2O2
Mol. Mass.:
434.5289
SMILES:
O=C1N(Cc2ccccc2)C(OCCNc2ccccc2)(c2ccccc12)c1ccccc1
:
Substrate
Name:
biotinylated IP3 peptide
Synonyms:
b-IP3
Type:
Peptide
Mol. Mass.:
4116.56
Organism:
Description:
Residue:
37