Target
Cannabinoid receptor 1
Ligand
BDBM286107
Substrate
Meas. Tech.
Binding Assay
IC50
5500±n/a nM
Citation
 McElroy, JFChorvat, RJ Cannabinoid receptor antagonists/inverse agonists useful for treating metabolic disorders, including obesity and diabetes US Patent  US9987253 Publication Date 6/5/2018 
Target
Name:
Cannabinoid receptor 1
Synonyms:
Brain-type cannabinoid receptor CB-R CNR1_MOUSE Cannabinoid receptor | Cnr1
Type:
Enzyme
Mol. Mass.:
52842.52
Organism:
Mus musculus (Mouse)
Description:
P47746
Residue:
473
  
Inhibitor
Name:
BDBM286107
Synonyms:
US10617673, Example 4a (2S,4'R) US9517228, Example 4a (2S,4′R) | US9987253, Example 4a
Type:
Small organic molecule
Emp. Form.:
C27H27Cl2N5O3S
Mol. Mass.:
572.506
SMILES:
CC(C)[C@H](N\C(=N/S(=O)(=O)c1ccc(Cl)cc1)N1C[C@H](C(=N1)c1ccc(Cl)cc1)c1ccccc1)C(N)=O
: