Target
E3 ubiquitin-protein ligase Mdm2
Ligand
BDBM31284
Substrate
CREB-binding protein/p53
Meas. Tech.
ELISA-Based p53-MDM2 Binding Assay
pH
7.6±n/a
Temperature
310.15±n/a K
IC50
31800±6020 nM
Citation
 Galatin, PSAbraham, DJ A nonpeptidic sulfonamide inhibits the p53-mdm2 interaction and activates p53-dependent transcription in mdm2-overexpressing cells. J Med Chem 47:4163-5 (2004)  
Target
Name:
E3 ubiquitin-protein ligase Mdm2
Synonyms:
Double minute 2 protein E3 ubiquitin-protein ligase Mdm2 (p53-binding protein Mdm2) Human Double Minute 2 (HDM2) MDM2-MDMX p53-Binding Protein MDM2 | p53-binding protein
Type:
Oncoprotein
Mol. Mass.:
55196.54
Organism:
Homo sapiens (Human)
Description:
Q00987
Residue:
491
  
Inhibitor
Name:
BDBM31284
Synonyms:
CHEMBL361676 | NSC 279287
Type:
Small organic molecule
Emp. Form.:
C31H27N5O6S
Mol. Mass.:
597.641
SMILES:
CC(C)Oc1ccc(cc1)C(=O)NS(=O)(=O)c1ccc(cc1)N=Nc1c(O)n(-c2ccccc2)n(-c2ccccc2)c1=O
:
Substrate
Name:
Cellular tumor antigen p53
Synonyms:
Antigen NY-CO-13 GST-p53 P53 Phosphoprotein p53 Tumor Suppressor p53
Type:
fusion protein
Mol. Mass.:
43654.73
Organism:
Homo sapiens (Human)
Description:
The full-length His6-wt-p53 expressed in E. coli was used in assays.
Residue:
393