Target
E3 ubiquitin-protein ligase Mdm2
Ligand
BDBM31295
Substrate
Fl 9mer
Meas. Tech.
Fluorescent Peptide Displacement Assay
pH
7.5±n/a
Temperature
296.15±n/a K
IC50
2600±n/a nM
Citation
 Leonard, KMarugan, JJRaboisson, PCalvo, RGushue, JMKoblish, HKLattanze, JZhao, SCummings, MDPlayer, MRMaroney, ACLu, T Novel 1,4-benzodiazepine-2,5-diones as Hdm2 antagonists with improved cellular activity. Bioorg Med Chem Lett 16:3463-8 (2006)  
Target
Name:
E3 ubiquitin-protein ligase Mdm2
Synonyms:
Double minute 2 protein E3 ubiquitin-protein ligase Mdm2 (p53-binding protein Mdm2) Human Double Minute 2 (HDM2) MDM2-MDMX p53-Binding Protein MDM2 | p53-binding protein
Type:
Oncoprotein
Mol. Mass.:
55196.54
Organism:
Homo sapiens (Human)
Description:
Q00987
Residue:
491
  
Inhibitor
Name:
BDBM31295
Synonyms:
1,4-benzodiazepine-2,5-dione scaffold, 27
Type:
Small organic molecule
Emp. Form.:
C29H28Cl2FIN4O3
Mol. Mass.:
697.366
SMILES:
C[C@@H](N1[C@@H](c2ccc(Cl)cc2)C(=O)N(CCN2CCOCC2)c2ccc(I)cc2C1=O)c1cc(F)c(Cl)cc1N
:
Substrate
Name:
Fl 9mer
Synonyms:
Type:
fluorescent peptide
Mol. Mass.:
2263.48
Organism:
Description:
Residue:
18
FLRESCEINFMDYWEGLN