Target
E3 ubiquitin-protein ligase Mdm2
Ligand
BDBM31318
Substrate
Fl 9mer
Meas. Tech.
Fluorescent Peptide Displacement Assay
pH
7.5±n/a
Temperature
296.15±n/a K
IC50
540±n/a nM
Citation
 Parks, DJLaFrance, LVCalvo, RRMilkiewicz, KLMarugán, JJRaboisson, PSchubert, CKoblish, HKZhao, SFranks, CFLattanze, JCarver, TECummings, MDMaguire, DGrasberger, BLMaroney, ACLu, T Enhanced pharmacokinetic properties of 1,4-benzodiazepine-2,5-dione antagonists of the HDM2-p53 protein-protein interaction through structure-based drug design. Bioorg Med Chem Lett 16:3310-4 (2006)  
Target
Name:
E3 ubiquitin-protein ligase Mdm2
Synonyms:
Double minute 2 protein E3 ubiquitin-protein ligase Mdm2 (p53-binding protein Mdm2) Human Double Minute 2 (HDM2) MDM2-MDMX p53-Binding Protein MDM2 | p53-binding protein
Type:
Oncoprotein
Mol. Mass.:
55196.54
Organism:
Homo sapiens (Human)
Description:
Q00987
Residue:
491
  
Inhibitor
Name:
BDBM31318
Synonyms:
1,4-benzodiazepine-2,5-dione antagonist, 2 | Racemic mixture of (S, S) and (R, R) isomers.
Type:
Small organic molecule
Emp. Form.:
C24H17Cl2IN2O4
Mol. Mass.:
595.213
SMILES:
OC(=O)C[C@@H](N1[C@@H](c2ccc(Cl)cc2)C(=O)Nc2ccc(I)cc2C1=O)c1ccc(Cl)cc1
:
Substrate
Name:
Fl 9mer
Synonyms:
Type:
fluorescent peptide
Mol. Mass.:
2263.48
Organism:
Description:
Residue:
18
FLRESCEINFMDYWEGLN