Target
5-hydroxytryptamine receptor 1E
Ligand
BDBM31021
Substrate
Not Available
Meas. Tech.
Dose Response Cell Based High Throughput Screening Assay for Agonists of the 5-Hydroxytryptamine Receptor Subtype 1E (5HT1E)
pH
7.4±n/a
Temperature
296.15±n/a K
EC50
23.87±n/a nM
Citation
 PubChem, PC Dose Response Cell Based High Throughput Screening Assay for Agonists of the 5-Hydroxytryptamine Receptor Subtype 1E (5HT1E) PubChem Bioassay (2007)[AID] 
Target
Name:
5-hydroxytryptamine receptor 1E
Synonyms:
5-HT-1E 5-Hydroxytryptamine Receptor Subtype 1E (5HT1E) 5-hydroxytryptamine receptor 1E (5-HT-1E) (S31) 5HT1E_HUMAN S31 Serotonin 1e (5-HT1e) receptor | Serotonin Receptor 1E
Type:
G Protein-Coupled Receptor (GPCR)
Mol. Mass.:
41697.80
Organism:
Homo sapiens (Human)
Description:
gi_112822
Residue:
365
  
Inhibitor
Name:
BDBM31021
Synonyms:
3-(1-ethyl-1,2,3,6-tetrahydropyridin-4-yl)-1H-indole MLS000093713 cid_51703
Type:
Small organic molecule
Emp. Form.:
C15H18N2
Mol. Mass.:
226.3168
SMILES:
CCN1CCC(=CC1)c1c[nH]c2ccccc12
:
Substrate
Name:
Not Available
Synonyms:
Type:
Mol. Mass.:
358.43
Organism:
Description:
Residue:
3
NA