Target
Orexin receptor type 2
Ligand
BDBM397103
Substrate
Meas. Tech.
FLIPR Ca2+ Flux Assay
IC50
84.0±n/a nM
Citation
 Kuduk, SDLiverton, NReger, TSSkudlarek, JW 5,5-bicyclic oxazole orexin receptor antagonists US Patent  US9987255 Publication Date 6/5/2018 
Target
Name:
Orexin receptor type 2
Synonyms:
HCRTR2 OX2R_HUMAN Orexin receptor type 2 (OR-2) Orexin receptor type 2 (OX2R) Ox-2-R | Ox2-R
Type:
Protein
Mol. Mass.:
50710.53
Organism:
Homo sapiens (Human)
Description:
O43614
Residue:
444
  
Inhibitor
Name:
BDBM397103
Synonyms:
2-{5-methyl-2-[5-{(3-(2H-1,2,3- triazol-2-yl)pyridin-2-yl]carbonyl} hexahydropyrrolo[3,4-c]pyrrol-2(1H)- yl]-1,3-oxazol-4-yl}propan-2-ol | US9987255, 17
Type:
Small organic molecule
Emp. Form.:
C21H25N7O3
Mol. Mass.:
423.4683
SMILES:
Cc1oc(nc1C(C)(C)O)N1CC2CN(CC2C1)C(=O)c1ncccc1-n1nccn1
: