Target
Neuronal acetylcholine receptor subunit alpha-7
Ligand
BDBM397121
Substrate
Meas. Tech.
FlexStation-Ca2+ Influx Assay
EC50
<100±n/a nM
Citation
 Maeng, CYJang, YKCha, SBShin, HWJoung, CMYi, EJ Pharmaceutical composition comprising pyridone derivatives US Patent  US9987259 Publication Date 6/5/2018 
Target
Name:
Neuronal acetylcholine receptor subunit alpha-7
Synonyms:
ACHA7_HUMAN Cholinergic, Nicotinic Alpha7 Neuronal acetylcholine receptor protein alpha-7 subunit Nicotinic acetylcholine receptor alpha-7 (alpha7 nAChR)
Type:
Mol. Mass.:
56448.33
Organism:
Homo sapiens (Human)
Description:
CHRNA7 (NACHRA7)
Residue:
502
  
Inhibitor
Name:
BDBM397121
Synonyms:
N-[(3R)-1-azabicyclo[2.2.2]octan-3-yl]-1-(5-ethyl-2-thiazolyl)-6-oxo-3-pyridinecarboxamide US9987259, Example 14
Type:
Small organic molecule
Emp. Form.:
C18H22N4O2S
Mol. Mass.:
358.458
SMILES:
CCc1cnc(s1)-n1cc(ccc1=O)C(=O)N[C@H]1CN2CCC1CC2
: