Target
Coagulation factor VII
Ligand
BDBM31467
Substrate
Spectrozyme-FVIIa
Meas. Tech.
TF-FVIIa Enzyme Inhibition Assay
pH
7.2±n/a
Temperature
296.15±n/a K
IC50
13±n/a nM
Citation
 Kotian, PLKrishnan, RRowland, SEl-Kattan, YSaini, SKUpshaw, RBantia, SArnold, SBabu, YSChand, P Design, parallel synthesis, and crystal structures of biphenyl antithrombotics as selective inhibitors of tissue factor FVIIa complex. Part 1: Exploration of S2 pocket pharmacophores. Bioorg Med Chem 17:3934-58 (2009)  
Target
Name:
Coagulation factor VII
Synonyms:
Eptacog alfa FA7_HUMAN Factor VIIa (fVIIa) SPCA serum prothrombin conversion accelerator
Type:
Enzyme
Mol. Mass.:
51599.89
Organism:
Homo sapiens (Human)
Description:
Residue:
466
  
Inhibitor
Name:
BDBM31467
Synonyms:
substituted biphenyl derivative, 36g
Type:
Small organic molecule
Emp. Form.:
C29H30N4O4
Mol. Mass.:
498.5729
SMILES:
CC(C)CNC(=O)c1ccc(c(c1)C(O)=O)-c1ccc(cc1C(=O)Nc1ccc(cc1)C(N)=N)C(C)=C
:
Substrate
Name:
Spectrozyme-FVIIa
Synonyms:
CH3SO2-D-CHA-But-Arg-pNA.AcOH | methanesulphonyl- D-cyclohexylalanyl-butyl-arginine p-nitroanilide acetate
Type:
Chromogenic peptide substrate
Mol. Mass.:
358.43
Organism:
Description:
Residue:
3
NA