Target
Prothrombin
Ligand
BDBM31487
Substrate
BDBM31505
Meas. Tech.
TF-FVIIa Enzyme Inhibition Assay
Temperature
298.15±n/a K
IC50
14990±n/a nM
Comments
extracted
Citation
 Kotian, PLKrishnan, RRowland, SEl-Kattan, YSaini, SKUpshaw, RBantia, SArnold, SBabu, YSChand, P Design, parallel synthesis, and crystal structures of biphenyl antithrombotics as selective inhibitors of tissue factor FVIIa complex. Part 1: Exploration of S2 pocket pharmacophores. Bioorg Med Chem 17:3934-58 (2009)  
Target
Name:
Prothrombin
Synonyms:
Activation peptide fragment 1 Coagulation factor II Prothrombin precursor Thrombin heavy chain | Thrombin light chain
Type:
Protein
Mol. Mass.:
70029.57
Organism:
Homo sapiens (Human)
Description:
P00734
Residue:
622
  
Inhibitor
Name:
BDBM31487
Synonyms:
substituted biphenyl derivative, 36aa
Type:
Small organic molecule
Emp. Form.:
C30H28N4O4S
Mol. Mass.:
540.633
SMILES:
CC(C)CNC(=O)c1ccc(c(c1)C(O)=O)-c1ccc(cc1C(=O)Nc1ccc(cc1)C(N)=N)-c1ccsc1
:
Substrate
Name:
BDBM31505
Synonyms:
N-Benzoyl-L-phenylalanyl-L-valyl-L-arginine-4-nitroanilide hydrochloride | Thrombin substrate
Type:
Emp. Form.:
C33H40N8O6
Mol. Mass.:
644.7207
SMILES:
CC(C)C(NC(=O)C(Cc1ccccc1)NC(=O)c1ccccc1)C(=O)NC(CCC[N-]C(N)=[NH2+])C(=O)Nc1ccc(cc1)[N+]([O-])=O
: