Target
Coagulation factor X
Ligand
BDBM31475
Substrate
BDBM31507
Meas. Tech.
Thrombin Inhibition Assay
Temperature
298.15±n/a K
IC50
11270±n/a nM
Comments
extracted
Citation
 Kotian, PLKrishnan, RRowland, SEl-Kattan, YSaini, SKUpshaw, RBantia, SArnold, SBabu, YSChand, P Design, parallel synthesis, and crystal structures of biphenyl antithrombotics as selective inhibitors of tissue factor FVIIa complex. Part 1: Exploration of S2 pocket pharmacophores. Bioorg Med Chem 17:3934-58 (2009)  
Target
Name:
Coagulation factor X
Synonyms:
Activated coagulation factor X (FXa) Coagulation factor X precursor F10 Factor X heavy chain Factor Xa Stuart-Prower factor
Type:
Enzyme
Mol. Mass.:
54726.60
Organism:
Homo sapiens (Human)
Description:
Residue:
488
  
Inhibitor
Name:
BDBM31475
Synonyms:
substituted biphenyl derivative, 36o
Type:
Small organic molecule
Emp. Form.:
C30H32N4O5
Mol. Mass.:
528.5989
SMILES:
CC(C)CNC(=O)c1ccc(c(c1)C(O)=O)-c1ccc(cc1C(=O)Nc1ccc(cc1)C(N)=N)C(=C)CCO
:
Substrate
Name:
BDBM31507
Synonyms:
Chromozym X | N-Methoxycarbonyl-D-norleucyl-glycyl-L-arginine-4- nitranilide-acetate
Type:
Emp. Form.:
Mol. Mass.:
SMILES:
: