Target
Neuromedin-K receptor
Ligand
BDBM242757
Substrate
Meas. Tech.
Binding Competition Assay
Ki
69.0±n/a nM
Citation
 Hoveyda, HDutheuil, GFraser, G N-acyl-(3-substituted)-(8-substituted)-5,6-dihydro-[1,2,4]triazolo[4,3-a]pyrazines as selective NK-3 receptor antagonists US Patent  US9987274 Publication Date 6/5/2018 
Target
Name:
Neuromedin-K receptor
Synonyms:
NK-3 receptor NK3R NKR Neurokinin B receptor Neuromedin-3 receptor (NK-3R) Neuromedin-K receptor Neuromedin-K receptor (NK3) TAC3R Tachykinin receptor 3 | Tachykinin receptor 3 (NK3)
Type:
Enzyme
Mol. Mass.:
52221.96
Organism:
Homo sapiens (Human)
Description:
P29371
Residue:
465
  
Inhibitor
Name:
BDBM242757
Synonyms:
US10030025, Compound 22 US11731974, Compound 22 US9987274, Compound 22
Type:
Small organic molecule
Emp. Form.:
C17H17FN6OS
Mol. Mass.:
372.42
SMILES:
CC[C@H]1N(CCn2c1nnc2-c1nc(C)ns1)C(=O)c1ccc(F)cc1
: