Target
Tyrosine-protein kinase ITK/TSK
Ligand
BDBM397224
Substrate
Meas. Tech.
Omnia Assay
IC50
<10±n/a nM
Citation
 Singh, JPetter, RCTester, RWKluge, AFMazdiyasni, HWestlin, III, WFNiu, DQiao, L Substituted 2,4-diaminopyrimidines as kinase inhibitors US Patent  US9987276 Publication Date 6/5/2018 
Target
Name:
Tyrosine-protein kinase ITK/TSK
Synonyms:
EMT ITK_HUMAN LYK Tyrosine-protein kinase ITK Tyrosine-protein kinase Lyk
Type:
Protein
Mol. Mass.:
71839.20
Organism:
Homo sapiens (Human)
Description:
Q08881
Residue:
620
  
Inhibitor
Name:
BDBM397224
Synonyms:
US9987276, Compound I-170
Type:
Small organic molecule
Emp. Form.:
C24H23N5O4
Mol. Mass.:
445.4705
SMILES:
COc1ccc(Nc2ncc(C(C)=O)c(Nc3ccc4OCCN(C(=O)C=C)c4c3)n2)cc1
: