Target
Cytoplasmic tyrosine-protein kinase BMX
Ligand
BDBM397195
Substrate
Meas. Tech.
Inhibition Assay
IC50
<10±n/a nM
Citation
 Singh, JPetter, RCTester, RWKluge, AFMazdiyasni, HWestlin, III, WFNiu, DQiao, L Substituted 2,4-diaminopyrimidines as kinase inhibitors US Patent  US9987276 Publication Date 6/5/2018 
Target
Name:
Cytoplasmic tyrosine-protein kinase BMX
Synonyms:
BMX BMX_HUMAN Cytoplasmic tyrosine-protein kinase BMX (BMX) Epithelial and endothelial tyrosine kinase Tyrosine Kinase BMX | Tyrosine-protein kinase BMX/ETK
Type:
Tyrosine-protein kinase
Mol. Mass.:
78030.42
Organism:
Homo sapiens (Human)
Description:
P51813
Residue:
675
  
Inhibitor
Name:
BDBM397195
Synonyms:
US10596172, Compound I-134 US11351168, Compound I-134 | US9987276, Compound I-134
Type:
Small organic molecule
Emp. Form.:
C21H20FN5O3
Mol. Mass.:
409.4136
SMILES:
COc1ccc(Nc2ncc(F)c(Nc3cccc(NC(=O)C=C)c3)n2)cc1OC
: