Target
Epidermal growth factor receptor
Ligand
BDBM397162
Substrate
Meas. Tech.
Omnia Assay
IC50
<10±n/a nM
Citation
 Singh, JPetter, RCTester, RWKluge, AFMazdiyasni, HWestlin, III, WFNiu, DQiao, L Substituted 2,4-diaminopyrimidines as kinase inhibitors US Patent  US9987276 Publication Date 6/5/2018 
Target
Name:
Epidermal growth factor receptor
Synonyms:
EGF Receptor Substrate EGFR_HUMAN ERBB1 Epidermal Growth Factor Receptor erbB-1 Epidermal growth factor receptor (EGFR) HER1 Proto-oncogene c-ErbB-1 Tyrosine-Protein Kinase ErbB-1
Type:
Receptor Kinase Domain
Mol. Mass.:
134279.59
Organism:
Homo sapiens (Human)
Description:
P00533
Residue:
1210
  
Inhibitor
Name:
BDBM397162
Synonyms:
US10596172, Compound I-76 US11351168, Compound I-76 US9987276, Compound I-81
Type:
Small organic molecule
Emp. Form.:
C26H29FN6O2
Mol. Mass.:
476.5459
SMILES:
CN1CCCC(COc2cccc(Nc3ncc(F)c(Nc4cccc(NC(=O)C=C)c4)n3)c2)C1
: