Target
Tyrosine-protein kinase JAK3
Ligand
BDBM397265
Substrate
Meas. Tech.
Omnia Assay
IC50
<10±n/a nM
Citation
 Singh, JPetter, RCTester, RWKluge, AFMazdiyasni, HWestlin, III, WFNiu, DQiao, L Substituted 2,4-diaminopyrimidines as kinase inhibitors US Patent  US9987276 Publication Date 6/5/2018 
Target
Name:
Tyrosine-protein kinase JAK3
Synonyms:
JAK-3 JAK3_HUMAN Janus kinase 3 (JAK3) L-JAK | Leukocyte janus kinase
Type:
Protein
Mol. Mass.:
125111.08
Organism:
Homo sapiens (Human)
Description:
P52333
Residue:
1124
  
Inhibitor
Name:
BDBM397265
Synonyms:
US10596172, Compound I-245 US11351168, Compound I-245 | US9987276, Compound I-245
Type:
Small organic molecule
Emp. Form.:
C20H16F3N5O
Mol. Mass.:
399.3691
SMILES:
FC(F)(F)c1cnc(Nc2ccccc2)nc1Nc1cccc(NC(=O)C=C)c1
: