Target
Lys-gingipain W83
Ligand
BDBM397432
Substrate
Meas. Tech.
Inhibition Assay
IC50
75±n/a nM
Citation
 Konradi, ADominy, SSLynch, CCCoburn, CVacca, J Inhibitors of lysine gingipain US Patent  US9988375 Publication Date 6/5/2018 
Target
Name:
Lys-gingipain W83
Synonyms:
KGP83_PORGN Lysine specific cysteine protease Porphypain kgp prtP
Type:
Mol. Mass.:
187834.89
Organism:
Porphyromonas gingivalis
Description:
Q51817
Residue:
1732
  
Inhibitor
Name:
BDBM397432
Synonyms:
US10676470, Compound 1 US9988375, Compound 1
Type:
Small organic molecule
Emp. Form.:
C20H21N3O2S
Mol. Mass.:
367.465
SMILES:
NCCCC[C@H](NC(=O)c1ccccc1)C(=O)c1nc2ccccc2s1
: