Target
Lys-gingipain W83
Ligand
BDBM397451
Substrate
Meas. Tech.
Inhibition Assay
IC50
37.5±n/a nM
Citation
 Konradi, ADominy, SSLynch, CCCoburn, CVacca, J Inhibitors of lysine gingipain US Patent  US9988375 Publication Date 6/5/2018 
Target
Name:
Lys-gingipain W83
Synonyms:
KGP83_PORGN Lysine specific cysteine protease Porphypain kgp prtP
Type:
Mol. Mass.:
187834.89
Organism:
Porphyromonas gingivalis
Description:
Q51817
Residue:
1732
  
Inhibitor
Name:
BDBM397451
Synonyms:
US9988375, Compound 26
Type:
Small organic molecule
Emp. Form.:
C19H25N3O3S
Mol. Mass.:
375.485
SMILES:
NCCCCC(NC(=O)C1CCCCO1)C(=O)c1nc2ccccc2s1
: