Target
Glycogen synthase kinase-3 alpha
Ligand
BDBM330271
Substrate
Meas. Tech.
Enzyme Inhibition Assay
IC50
>16200±n/a nM
Citation
 Ito, KCharron, CEKing-Underwood, JOnions, STLongshaw, AI 1-pyrazolyl-3-(4-((2-anilinopyrimidin-4-yl) oxy) napththalen-1-yl) ureas as P38 MAP knase inhibitors US Patent  US9993478 Publication Date 6/12/2018 
Target
Name:
Glycogen synthase kinase-3 alpha
Synonyms:
GSK-3 alpha GSK3A_HUMAN Glycogen synthase kinase-3 Glycogen synthase kinase-3 alpha (GSK3 Alpha) Glycogen synthase kinase-3 alpha (GSK3alpha)
Type:
Enzyme
Mol. Mass.:
50991.79
Organism:
Homo sapiens (Human)
Description:
P49840
Residue:
483
  
Inhibitor
Name:
BDBM330271
Synonyms:
1-(3-(tert-butyl)-1-(p-tolyl)-1H-pyrazol-5-yl)- 3-(4-((2-((3-chlorophenyl)amino)pyrimidin- 4-yl)oxy)naphthalen-1-yl)urea US10813932, Example 13 US9993478, Example 13
Type:
Small organic molecule
Emp. Form.:
C35H32ClN7O2
Mol. Mass.:
618.127
SMILES:
Cc1ccc(cc1)-n1nc(cc1NC(=O)Nc1ccc(Oc2ccnc(Nc3cccc(Cl)c3)n2)c2ccccc12)C(C)(C)C
: