Target
Mitogen-activated protein kinase 12
Ligand
BDBM330291
Substrate
Meas. Tech.
Enzyme Inhibition Assay
IC50
264±n/a nM
Citation
 Ito, KCharron, CEKing-Underwood, JOnions, STLongshaw, AI 1-pyrazolyl-3-(4-((2-anilinopyrimidin-4-yl) oxy) napththalen-1-yl) ureas as P38 MAP knase inhibitors US Patent  US9993478 Publication Date 6/12/2018 
Target
Name:
Mitogen-activated protein kinase 12
Synonyms:
ERK6 MAPK12 Mitogen-activated protein kinase 12 (MAPK12 p38 gamma) Mitogen-activated protein kinase 12 Gamma SAPK3 | p38 delta/gamma
Type:
Protein
Mol. Mass.:
41938.69
Organism:
Homo sapiens (Human)
Description:
P53778
Residue:
367
  
Inhibitor
Name:
BDBM330291
Synonyms:
1-(3-(tert-butyl)-1-(4-methoxyphenyl)-1H- pyrazol-5-yl)-3-(4-((2-((4-hydroxyphenyl) amino)pyrimidin-4-yl)oxy)naphthalen-1- yl)urea US10813932, Example 33 US9993478, Example 33
Type:
Small organic molecule
Emp. Form.:
C35H33N7O4
Mol. Mass.:
615.681
SMILES:
COc1ccc(cc1)-n1nc(cc1NC(=O)Nc1ccc(Oc2ccnc(Nc3ccc(O)cc3)n2)c2ccccc12)C(C)(C)C
: