Target
Mitogen-activated protein kinase 14
Ligand
BDBM31608
Substrate
biotinylated GST-ATF2
Meas. Tech.
P38alpha Kinase Inhibition Assay
pH
7.5±n/a
Temperature
298.15±n/a K
IC50
967±1.13 nM
Citation
 Lumeras, WCaturla, FVidal, LEsteve, CBalagué, COrellana, ADomínguez, MRoca, RHuerta, JMGodessart, NVidal, B Design, synthesis, and structure-activity relationships of aminopyridine N-oxides, a novel scaffold for the potent and selective inhibition of p38 mitogen activated protein kinase. J Med Chem 52:5531-45 (2009)  
Target
Name:
Mitogen-activated protein kinase 14
Synonyms:
CSAID-binding protein CSBP1 CSPB1 MAP kinase 14 MAP kinase p38 alpha MAPK14 MK14_HUMAN Mitogen-activated protein kinase p38 alpha Stress-activated protein kinase 2a | p38 MAP kinase alpha/beta
Type:
Serine/threonine-protein kinase
Mol. Mass.:
41286.76
Organism:
Homo sapiens (Human)
Description:
Q16539
Residue:
360
  
Inhibitor
Name:
BDBM31608
Synonyms:
Aminopyridine N-oxide, 34
Type:
Small organic molecule
Emp. Form.:
C18H14N2O2
Mol. Mass.:
290.316
SMILES:
Nc1c(cc[n+]([O-])c1-c1ccccc1)C(=O)c1ccccc1
:
Substrate
Name:
biotinylated GST-ATF2
Synonyms:
ATF-2-GST Activating transcription factor 2 GST-ATF2 biotinylated activating transcription factor 2
Type:
Other Protein Type
Mol. Mass.:
12237.77
Organism:
Homo sapiens (Human)
Description:
Residue:
109