Target
Heme oxygenase 1
Ligand
BDBM31671
Substrate
methemalbumin
Meas. Tech.
In Vitro HO Activity Assay
pH
7.4±n/a
Temperature
310.15±n/a K
IC50
590±40 nM
Citation
 Vlahakis, JZHum, MRahman, MNJia, ZNakatsu, KSzarek, WA Synthesis and evaluation of imidazole-dioxolane compounds as selective heme oxygenase inhibitors: effect of substituents at the 4-position of the dioxolane ring. Bioorg Med Chem 17:2461-75 (2009)  
Target
Name:
Heme oxygenase 1
Synonyms:
HMOX1_RAT Heme Oxygenase 1 (HO-1) Hmox1
Type:
Enzyme
Mol. Mass.:
33005.15
Organism:
Rattus norvegicus (rat)
Description:
HO-1 obtained from rat spleen was used in enzyme assays.
Residue:
289
  
Inhibitor
Name:
BDBM31671
Synonyms:
imidazole-dioxolane, 23
Type:
Small organic molecule
Emp. Form.:
C22H23ClN2O3
Mol. Mass.:
398.883
SMILES:
Clc1ccc(CC[C@@]2(Cn3ccnc3)OC[C@@H](COc3ccccc3)O2)cc1
:
Substrate
Name:
methemalbumin
Synonyms:
ALB heme complexed with albumin
Type:
albumin complex
Mol. Mass.:
66464.47
Organism:
Homo sapiens (Human)
Description:
Sequence of human serum albumin is shown here.
Residue:
585