Target
Heme oxygenase 2
Ligand
BDBM31661
Substrate
methemalbumin
Meas. Tech.
In Vitro HO Activity Assay
pH
7.4±n/a
IC50
5000±n/a nM
Comments
extracted
Citation
 Vlahakis, JZHum, MRahman, MNJia, ZNakatsu, KSzarek, WA Synthesis and evaluation of imidazole-dioxolane compounds as selective heme oxygenase inhibitors: effect of substituents at the 4-position of the dioxolane ring. Bioorg Med Chem 17:2461-75 (2009)  
Target
Name:
Heme oxygenase 2
Synonyms:
HMOX2_RAT Heme oxygenase 2 | Hmox2
Type:
Enzyme
Mol. Mass.:
35754.99
Organism:
Rattus norvegicus (rat)
Description:
HO-2 obtained from rat brain was used in enzyme assays.
Residue:
315
  
Inhibitor
Name:
BDBM31661
Synonyms:
imidazole-dioxolane, 13
Type:
Small organic molecule
Emp. Form.:
C22H22ClFN2O2S
Mol. Mass.:
432.939
SMILES:
Fc1ccc(SC[C@@H]2CO[C@@](CCc3ccc(Cl)cc3)(Cn3ccnc3)O2)cc1
:
Substrate
Name:
methemalbumin
Synonyms:
ALB heme complexed with albumin
Type:
albumin complex
Mol. Mass.:
66464.47
Organism:
Homo sapiens (Human)
Description:
Sequence of human serum albumin is shown here.
Residue:
585