Target
Histamine H3 receptor
Ligand
BDBM397476
Substrate
Meas. Tech.
In Vitro Binding Assay
Ki
30±n/a nM
Citation
 Bartáné Szalai, GWágner, GAKiss, BSchmidt, nullBalázs, ONagy, N H3 antagonists containing phenoxypiperidine core structure US Patent  US9994525 Publication Date 6/12/2018 
Target
Name:
Histamine H3 receptor
Synonyms:
HH3R Hrh3
Type:
G Protein-Coupled Receptor (GPCR)
Mol. Mass.:
48607.98
Organism:
Rattus norvegicus (rat)
Description:
Residue:
445
  
Inhibitor
Name:
BDBM397476
Synonyms:
US9994525, Example 2
Type:
Small organic molecule
Emp. Form.:
C19H30N2O2
Mol. Mass.:
318.4537
SMILES:
C(COc1ccc(OC2CCNCC2)cc1)CN1CCCCC1
: