Target
Histamine H3 receptor
Ligand
BDBM397492
Substrate
Meas. Tech.
In Vitro Binding Assay
Ki
30±n/a nM
Citation
 Bartáné Szalai, GWágner, GAKiss, BSchmidt, nullBalázs, ONagy, N H3 antagonists containing phenoxypiperidine core structure US Patent  US9994525 Publication Date 6/12/2018 
Target
Name:
Histamine H3 receptor
Synonyms:
HH3R Hrh3
Type:
G Protein-Coupled Receptor (GPCR)
Mol. Mass.:
48607.98
Organism:
Rattus norvegicus (rat)
Description:
Residue:
445
  
Inhibitor
Name:
BDBM397492
Synonyms:
US9994525, Example 7
Type:
Small organic molecule
Emp. Form.:
C22H35N3O3
Mol. Mass.:
389.5316
SMILES:
CCNC(=O)N1CCC(CC1)Oc1ccc(OCCCN2CCCCC2)cc1
: