Target
Lysine-specific histone demethylase 1A
Ligand
BDBM397510
Substrate
Meas. Tech.
Biochemical Assay
IC50
30±n/a nM
Citation
 Wu, LYao, W Cyclopropylamines as LSD1 inhibitors US Patent  US9994546 Publication Date 6/12/2018 
Target
Name:
Lysine-specific histone demethylase 1A
Synonyms:
AOF2 Flavin-containing amine oxidase domain-containing protein 2 KDM1A KIAA0601 Lysine-specific demethylase 1 (LSD1) Lysine-specific histone demethylase 1 (LSD1)
Type:
Enzyme
Mol. Mass.:
92901.01
Organism:
Homo sapiens (Human)
Description:
O60341
Residue:
852
  
Inhibitor
Name:
BDBM397510
Synonyms:
(1-(Methylsulfonyl)-3-{4-[(trans-2-phenylcyclopropyl)amino]piperidin-1-yl}azetidin-3-yl)acetonitrile US11155532, Example 9 | US9994546, Example 9
Type:
Small organic molecule
Emp. Form.:
C20H28N4O2S
Mol. Mass.:
388.527
SMILES:
CS(=O)(=O)N1CC(CC#N)(C1)N1CCC(CC1)NC1CC1c1ccccc1
: