Target
Lysine-specific histone demethylase 1A
Ligand
BDBM397535
Substrate
Meas. Tech.
Biochemical Assay
IC50
30±n/a nM
Citation
 Wu, LYao, W Cyclopropylamines as LSD1 inhibitors US Patent  US9994546 Publication Date 6/12/2018 
Target
Name:
Lysine-specific histone demethylase 1A
Synonyms:
AOF2 Flavin-containing amine oxidase domain-containing protein 2 KDM1A KIAA0601 Lysine-specific demethylase 1 (LSD1) Lysine-specific histone demethylase 1 (LSD1)
Type:
Enzyme
Mol. Mass.:
92901.01
Organism:
Homo sapiens (Human)
Description:
O60341
Residue:
852
  
Inhibitor
Name:
BDBM397535
Synonyms:
2-[3-(Cyanomethyl)-3-(4-{[(trans-2-phenylcyclopropyl)amino]methyl}piperidin-1-yl)azetidin-1-yl]nicotinonitrile US11155532, Example 34 | US9994546, Example 34
Type:
Small organic molecule
Emp. Form.:
C26H30N6
Mol. Mass.:
426.5566
SMILES:
N#CCC1(CN(C1)c1ncccc1C#N)N1CCC(CNC2CC2c2ccccc2)CC1
: