Target
Lysine-specific histone demethylase 1A
Ligand
BDBM397549
Substrate
Meas. Tech.
Biochemical Assay
IC50
30±n/a nM
Citation
 Wu, LYao, W Cyclopropylamines as LSD1 inhibitors US Patent  US9994546 Publication Date 6/12/2018 
Target
Name:
Lysine-specific histone demethylase 1A
Synonyms:
AOF2 Flavin-containing amine oxidase domain-containing protein 2 KDM1A KIAA0601 Lysine-specific demethylase 1 (LSD1) Lysine-specific histone demethylase 1 (LSD1)
Type:
Enzyme
Mol. Mass.:
92901.01
Organism:
Homo sapiens (Human)
Description:
O60341
Residue:
852
  
Inhibitor
Name:
BDBM397549
Synonyms:
US10676457, Example 48 US9994546, Example 48 | [1-(4-Fluorobenzoyl)-3-(4-{[(trans-2-phenylcyclopropyl)amino]methyl}piperidin-1-yl)azetidin-3-yl]acetonitrile
Type:
Small organic molecule
Emp. Form.:
C27H31FN4O
Mol. Mass.:
446.5596
SMILES:
Fc1ccc(cc1)C(=O)N1CC(CC#N)(C1)N1CCC(CNC2CC2c2ccccc2)CC1
: