Target
Lysine-specific histone demethylase 1A
Ligand
BDBM397576
Substrate
Meas. Tech.
Biochemical Assay
IC50
30±n/a nM
Citation
 Wu, LYao, W Cyclopropylamines as LSD1 inhibitors US Patent  US9994546 Publication Date 6/12/2018 
Target
Name:
Lysine-specific histone demethylase 1A
Synonyms:
AOF2 Flavin-containing amine oxidase domain-containing protein 2 KDM1A KIAA0601 Lysine-specific demethylase 1 (LSD1) Lysine-specific histone demethylase 1 (LSD1)
Type:
Enzyme
Mol. Mass.:
92901.01
Organism:
Homo sapiens (Human)
Description:
O60341
Residue:
852
  
Inhibitor
Name:
BDBM397576
Synonyms:
US10676457, Example 75 US9994546, Example 75 | [3-(4-{[(1R,2S)-2-phenylcyclopropyl]amino}piperidin-1-yl)-1-(tetrahydro-2H-pyran-4-yl)azetidin-3-yl]acetonitrile
Type:
Small organic molecule
Emp. Form.:
C24H34N4O
Mol. Mass.:
394.553
SMILES:
N#CCC1(CN(C1)C1CCOCC1)N1CCC(CC1)N[C@@H]1CC1c1ccccc1
: