Target
Lysine-specific histone demethylase 1A
Ligand
BDBM397585
Substrate
Meas. Tech.
Biochemical Assay
IC50
30±n/a nM
Citation
 Wu, LYao, W Cyclopropylamines as LSD1 inhibitors US Patent  US9994546 Publication Date 6/12/2018 
Target
Name:
Lysine-specific histone demethylase 1A
Synonyms:
AOF2 Flavin-containing amine oxidase domain-containing protein 2 KDM1A KIAA0601 Lysine-specific demethylase 1 (LSD1) Lysine-specific histone demethylase 1 (LSD1)
Type:
Enzyme
Mol. Mass.:
92901.01
Organism:
Homo sapiens (Human)
Description:
O60341
Residue:
852
  
Inhibitor
Name:
BDBM397585
Synonyms:
US10676457, Example 84 US9994546, Example 84 | [1-[(1-hydroxycyclopropyl)carbonyl]-3-(4-{[(1R,2S)-2-phenylcyclopropyl]amino}piperidin-1-yl)azetidin-3-yl]acetonitrile
Type:
Small organic molecule
Emp. Form.:
C23H30N4O2
Mol. Mass.:
394.5099
SMILES:
OC1(CC1)C(=O)N1CC(CC#N)(C1)N1CCC(CC1)N[C@@H]1CC1c1ccccc1
: