Target
Lysine-specific histone demethylase 1A
Ligand
BDBM397603
Substrate
Meas. Tech.
Biochemical Assay
IC50
30±n/a nM
Citation
 Wu, LYao, W Cyclopropylamines as LSD1 inhibitors US Patent  US9994546 Publication Date 6/12/2018 
Target
Name:
Lysine-specific histone demethylase 1A
Synonyms:
AOF2 Flavin-containing amine oxidase domain-containing protein 2 KDM1A KIAA0601 Lysine-specific demethylase 1 (LSD1) Lysine-specific histone demethylase 1 (LSD1)
Type:
Enzyme
Mol. Mass.:
92901.01
Organism:
Homo sapiens (Human)
Description:
O60341
Residue:
852
  
Inhibitor
Name:
BDBM397603
Synonyms:
3-(cyanomethyl)-3-(4-{[(1R,2S)-2-(4-fluorophenyl)cyclopropyl]amino}piperidin-1-yl)azetidine-1-sulfonamide US11155532, Example 102 | US9994546, Example 102
Type:
Small organic molecule
Emp. Form.:
C19H26FN5O2S
Mol. Mass.:
407.505
SMILES:
NS(=O)(=O)N1CC(CC#N)(C1)N1CCC(CC1)N[C@@H]1CC1c1ccc(F)cc1
: