Target
Dimer of Gag-Pol polyprotein [514-612]
Ligand
BDBM729
Substrate
decapeptide substrate
Meas. Tech.
Protease Inhibition Assay
pH
5.5±n/a
Temperature
310.15±n/a K
Ki
0.13±n/a nM
IC50
10±n/a nM
Citation
 Beaulieu, PLAnderson, PCCameron, DRCroteau, GGorys, VGrand-Maitre, CLamarre, DLiard, FParis, WPlamondon, LSoucy, FThibeault, DWernic, DYoakim, CPav, STong, L 2',6'-Dimethylphenoxyacetyl: a new achiral high affinity P(3)-P(2) ligand for peptidomimetic-based HIV protease inhibitors. J Med Chem 43:1094-108 (2000)  
Target
Name:
Dimer of Gag-Pol polyprotein [514-612]
Synonyms:
HIV-2 Protease
Type:
Protein Complex
Mol. Mass.:
Description:
Components:
This complex has 2 components.
Component 1
Name:
Gag-Pol polyprotein [514-612]
Synonyms:
HIV-2 Protease chain A POL_HV2RO | gag-pol
Type:
Enzyme Subunit
Mol. Mass.:
10718.25
Organism:
Human immunodeficiency virus type 2
Description:
P04584[514-612]
Residue:
99
  
Component 2
Name:
Gag-Pol polyprotein [514-612]
Synonyms:
HIV-2 Protease chain A POL_HV2RO | gag-pol
Type:
Enzyme Subunit
Mol. Mass.:
10718.25
Organism:
Human immunodeficiency virus type 2
Description:
P04584[514-612]
Residue:
99
  
Inhibitor
Name:
BDBM729
Synonyms:
(2S,4R)-N-tert-butyl-1-[(2R,3S)-2-hydroxy-3-[(2S)-3-methyl-2-(quinolin-2-ylformamido)butanamido]-4-phenylbutyl]-4-(pyridin-4-ylmethoxy)piperidine-2-carboxamide CHEMBL13134 | Palinavir
Type:
Small organic molecule
Emp. Form.:
C41H52N6O5
Mol. Mass.:
708.8888
SMILES:
CC(C)[C@H](NC(=O)c1ccc2ccccc2n1)C(=O)N[C@@H](Cc1ccccc1)[C@H](O)CN1CC[C@H](C[C@H]1C(=O)NC(C)(C)C)OCc1ccncc1
:
Substrate
Name:
decapeptide substrate
Synonyms:
Type:
Peptide
Mol. Mass.:
1417.08
Organism:
Description:
Residue:
12
VSFNFPQITLNH