Target
Dimer of Gag-Pol polyprotein [489-587]
Ligand
BDBM733
Substrate
decapeptide substrate
Meas. Tech.
Protease Inhibition Assay
pH
5.5±n/a
Temperature
310.15±n/a K
IC50
4200±n/a nM
Citation
 Beaulieu, PLAnderson, PCCameron, DRCroteau, GGorys, VGrand-Maitre, CLamarre, DLiard, FParis, WPlamondon, LSoucy, FThibeault, DWernic, DYoakim, CPav, STong, L 2',6'-Dimethylphenoxyacetyl: a new achiral high affinity P(3)-P(2) ligand for peptidomimetic-based HIV protease inhibitors. J Med Chem 43:1094-108 (2000)  
Target
Name:
Dimer of Gag-Pol polyprotein [489-587]
Synonyms:
HIV-1 Protease
Type:
Protein Complex
Mol. Mass.:
Description:
Components:
This complex has 2 components.
Component 1
Name:
Gag-Pol polyprotein [489-587]
Synonyms:
HIV protease HIV-1 Protease chain A POL_HV1N5 | gag-pol
Type:
Enzyme Subunit
Mol. Mass.:
10822.21
Organism:
Human immunodeficiency virus type 1
Description:
P12497[489-587]
Residue:
99
  
Component 2
Name:
Gag-Pol polyprotein [489-587]
Synonyms:
HIV protease HIV-1 Protease chain A POL_HV1N5 | gag-pol
Type:
Enzyme Subunit
Mol. Mass.:
10822.21
Organism:
Human immunodeficiency virus type 1
Description:
P12497[489-587]
Residue:
99
  
Inhibitor
Name:
BDBM733
Synonyms:
(2S,4R)-N-tert-butyl-1-[(2R,3S)-2-hydroxy-4-phenyl-3-[2-(phenylsulfanyl)acetamido]butyl]-4-(pyridin-4-ylmethoxy)piperidine-2-carboxamide | Palinavir deriv. 5
Type:
Small organic molecule
Emp. Form.:
C34H44N4O4S
Mol. Mass.:
604.803
SMILES:
CC(C)(C)NC(=O)[C@@H]1C[C@@H](CCN1C[C@@H](O)[C@H](Cc1ccccc1)NC(=O)CSc1ccccc1)OCc1ccncc1
:
Substrate
Name:
decapeptide substrate
Synonyms:
Type:
Peptide
Mol. Mass.:
1417.08
Organism:
Description:
Residue:
12
VSFNFPQITLNH