Target
Heme oxygenase 2
Ligand
BDBM31775
Substrate
methemalbumin
Meas. Tech.
In Vitro HO Activity Assay
pH
7.4±n/a
Temperature
310.15±n/a K
IC50
>100000±n/a nM
Citation
 Kinobe, RTDercho, RAVlahakis, JZBrien, JFSzarek, WANakatsu, K Inhibition of the enzymatic activity of heme oxygenases by azole-based antifungal drugs. J Pharmacol Exp Ther 319:277-84 (2006)  
Target
Name:
Heme oxygenase 2
Synonyms:
HMOX2_RAT Heme oxygenase 2 | Hmox2
Type:
Enzyme
Mol. Mass.:
35754.99
Organism:
Rattus norvegicus (rat)
Description:
HO-2 obtained from rat brain was used in enzyme assays.
Residue:
315
  
Inhibitor
Name:
BDBM31775
Synonyms:
Amudane Grisefuline | Griseofulvin
Type:
Small organic molecule
Emp. Form.:
C17H17ClO6
Mol. Mass.:
352.766
SMILES:
COC1=CC(=O)C[C@@H](C)[C@]11Oc2c(C1=O)c(OC)cc(OC)c2Cl
:
Substrate
Name:
methemalbumin
Synonyms:
ALB heme complexed with albumin
Type:
albumin complex
Mol. Mass.:
66464.47
Organism:
Homo sapiens (Human)
Description:
Sequence of human serum albumin is shown here.
Residue:
585