Target
Proto-oncogene tyrosine-protein kinase Src
Ligand
BDBM31824
Substrate
biotinylated poly-Glu-Tyr
Meas. Tech.
Kinetics Assay for IC50 Determination
pH
7±n/a
Temperature
296.15±n/a K
IC50
32100±7500 nM
Citation
 Getlik, MGrütter, CSimard, JRKlüter, SRabiller, MRode, HBRobubi, ARauh, D Hybrid compound design to overcome the gatekeeper T338M mutation in cSrc. J Med Chem 52:3915-26 (2009)  
Target
Name:
Proto-oncogene tyrosine-protein kinase Src
Synonyms:
Proto-oncogene c-Src SRC_CHICK c-Src p60c-src | pp60c-src
Type:
Tyr protein kinase
Mol. Mass.:
60015.36
Organism:
Gallus gallus (Chicken)
Description:
P00523
Residue:
533
  
Inhibitor
Name:
BDBM31824
Synonyms:
1-(1-(3-Aminophenyl)-3-tert-butyl-1H-pyrazol-5-yl)-3-(4-chlorophenyl)urea, 1a pyrazolourea, 1a
Type:
Small organic molecule
Emp. Form.:
C20H22ClN5O
Mol. Mass.:
383.875
SMILES:
CC(C)(C)c1cc(NC(=O)Nc2ccc(Cl)cc2)n(n1)-c1cccc(N)c1
:
Substrate
Name:
biotinylated poly-Glu-Tyr
Synonyms:
Type:
Peptide
Mol. Mass.:
358.43
Organism:
Description:
Residue:
3
NA