Target
Proto-oncogene tyrosine-protein kinase Src [251-533,T338M]
Ligand
BDBM13216
Substrate
biotinylated poly-Glu-Tyr
Meas. Tech.
Kinetics Assay for IC50 Determination
pH
7±n/a
Temperature
296.15±n/a K
IC50
480±400 nM
Citation
 Getlik, MGrütter, CSimard, JRKlüter, SRabiller, MRode, HBRobubi, ARauh, D Hybrid compound design to overcome the gatekeeper T338M mutation in cSrc. J Med Chem 52:3915-26 (2009)  
Target
Name:
Proto-oncogene tyrosine-protein kinase Src [251-533,T338M]
Synonyms:
Proto-oncogene tyrosine-protein kinase Src SRC_CHICK | Src Mutant (T338M)
Type:
Tyr protein kinase
Mol. Mass.:
32390.51
Organism:
Gallus gallus (Chicken)
Description:
Mutation of T338M was introduced by site-directed mutagenesis and confirmed by sequence analysis.
Residue:
283
  
Inhibitor
Name:
BDBM13216
Synonyms:
BMS-354825 DASATINIB N-(2-chloro-6-methylphenyl)-2-({6-[4-(2-hydroxyethyl)piperazin-1-yl]-2-methylpyrimidin-4-yl}amino)-1,3-thiazole-5-carboxamide US20230348453, Compound A8 med.21724, Compound Dasatinib
Type:
Small organic molecule
Emp. Form.:
C22H26ClN7O2S
Mol. Mass.:
488.006
SMILES:
Cc1nc(Nc2ncc(s2)C(=O)Nc2c(C)cccc2Cl)cc(n1)N1CCN(CCO)CC1
:
Substrate
Name:
biotinylated poly-Glu-Tyr
Synonyms:
Type:
Peptide
Mol. Mass.:
358.43
Organism:
Description:
Residue:
3
NA