Target
Proto-oncogene tyrosine-protein kinase Src [251-533,T338M]
Ligand
BDBM31828
Substrate
biotinylated poly-Glu-Tyr
Meas. Tech.
Kinetics Assay for IC50 Determination
pH
7±n/a
Temperature
296.15±n/a K
IC50
34±12 nM
Citation
 Getlik, MGrütter, CSimard, JRKlüter, SRabiller, MRode, HBRobubi, ARauh, D Hybrid compound design to overcome the gatekeeper T338M mutation in cSrc. J Med Chem 52:3915-26 (2009)  
Target
Name:
Proto-oncogene tyrosine-protein kinase Src [251-533,T338M]
Synonyms:
Proto-oncogene tyrosine-protein kinase Src SRC_CHICK | Src Mutant (T338M)
Type:
Tyr protein kinase
Mol. Mass.:
32390.51
Organism:
Gallus gallus (Chicken)
Description:
Mutation of T338M was introduced by site-directed mutagenesis and confirmed by sequence analysis.
Residue:
283
  
Inhibitor
Name:
BDBM31828
Synonyms:
quinazoline-pyrazolourea hybrid compound, 3b
Type:
Small organic molecule
Emp. Form.:
C29H30N8O
Mol. Mass.:
506.6015
SMILES:
Cc1cccc(c1)-n1nc(cc1NC(=O)Nc1ccc(Nc2ncnc3ccc(N)cc23)cc1)C(C)(C)C
:
Substrate
Name:
biotinylated poly-Glu-Tyr
Synonyms:
Type:
Peptide
Mol. Mass.:
358.43
Organism:
Description:
Residue:
3
NA