Target
Epidermal growth factor receptor [668-1210]
Ligand
BDBM4567
Substrate
Tyr 04 Substrate Peptide
Meas. Tech.
EGFR IC50 Determination
pH
7.5±n/a
Temperature
296.15±n/a K
IC50
0.08±n/a nM
Citation
 Michalczyk, AKlüter, SRode, HBSimard, JRGrütter, CRabiller, MRauh, D Structural insights into how irreversible inhibitors can overcome drug resistance in EGFR. Bioorg Med Chem 16:3482-8 (2008)  
Target
Name:
Epidermal growth factor receptor [668-1210]
Synonyms:
EGF-R Tyrosine Kinase EGFR_HUMAN ERBB1 HER1 | Receptor tyrosine-protein kinase ErbB-1
Type:
Cytoplasmic region
Mol. Mass.:
61304.06
Organism:
Homo sapiens (Human)
Description:
Wildtype EGFR was purchased from Invitrogen.
Residue:
543
  
Inhibitor
Name:
BDBM4567
Synonyms:
4-anilinoquinazoline deriv. 2 CHEMBL285063 US9422297, PD168393
Type:
Small organic molecule
Emp. Form.:
C17H13BrN4O
Mol. Mass.:
369.215
SMILES:
Brc1cccc(Nc2ncnc3ccc(NC(=O)C=C)cc23)c1
:
Substrate
Name:
Tyr 04 Substrate Peptide
Synonyms:
Type:
FRET-peptide substrate
Mol. Mass.:
358.43
Organism:
Description:
Residue:
3
NA