Target
Proto-oncogene tyrosine-protein kinase Src [251-533,T338M,S345C]
Ligand
BDBM31826
Substrate
Tyr 02 Substrate Peptide
Meas. Tech.
Src IC50 Determination
pH
7.5±n/a
Temperature
296.15±n/a K
IC50
>50000±n/a nM
Citation
 Michalczyk, AKlüter, SRode, HBSimard, JRGrütter, CRabiller, MRauh, D Structural insights into how irreversible inhibitors can overcome drug resistance in EGFR. Bioorg Med Chem 16:3482-8 (2008)  
Target
Name:
Proto-oncogene tyrosine-protein kinase Src [251-533,T338M,S345C]
Synonyms:
Proto-oncogene tyrosine-protein kinase Src SRC_CHICK cSRC-DM
Type:
Tyr protein kinase
Mol. Mass.:
32732.47
Organism:
Gallus gallus (Chicken)
Description:
Mutations of T338 to methionine and S345 to cysteine were introduced by site-directed mutagenesis and confirmed by sequence analysis.
Residue:
286
  
Inhibitor
Name:
BDBM31826
Synonyms:
4-aminoquinazoline, 2a CHEMBL188762
Type:
Small organic molecule
Emp. Form.:
C17H15BrN4O
Mol. Mass.:
371.231
SMILES:
CCC(=O)Nc1ccc2ncnc(Nc3cccc(Br)c3)c2c1
:
Substrate
Name:
Tyr 02 Substrate Peptide
Synonyms:
Type:
FRET-peptide substrate
Mol. Mass.:
358.43
Organism:
Description:
Residue:
3
NA