Target
Aurora kinase B
Ligand
BDBM31833
Substrate
Histone H3 (aa 1-18)
Meas. Tech.
Enzyme Inhibition Assay
pH
7.5±n/a
Temperature
295.15±n/a K
IC50
1400±n/a nM
Citation
 Aliagas-Martin, IBurdick, DCorson, LDotson, JDrummond, JFields, CHuang, OWHunsaker, TKleinheinz, TKrueger, ELiang, JMoffat, JPhillips, GPulk, RRawson, TEUltsch, MWalker, LWiesmann, CZhang, BZhu, BYCochran, AG A class of 2,4-bisanilinopyrimidine Aurora A inhibitors with unusually high selectivity against Aurora B. J Med Chem 52:3300-7 (2009)  
Target
Name:
Aurora kinase B
Synonyms:
AIK2 AIM1 ARK2 AURKB_HUMAN Aurora B-INCENP Aurora kinase B (AURKB) STK-1 STK12 Serine/threonine-protein kinase aurora B
Type:
Protein
Mol. Mass.:
39327.72
Organism:
Homo sapiens (Human)
Description:
Q96GD4
Residue:
344
  
Inhibitor
Name:
BDBM31833
Synonyms:
2,4-Bisanilinopyrimidine, 5
Type:
Small organic molecule
Emp. Form.:
C23H17ClFN5O2
Mol. Mass.:
449.865
SMILES:
Oc1ccc(Nc2ncc(F)c(Nc3ccc(NC(=O)c4ccccc4Cl)cc3)n2)cc1
:
Substrate
Name:
Histone H3 (aa 1-18)
Synonyms:
GST fusion of N-terminus of Histone H3 (aa 1-18) H3C1 H3FB H3FD H3FH H3FJ H3FL HIST1H3B HIST1H3E HIST1H3G HIST1H3I Histone H3
Type:
Peptide
Mol. Mass.:
1951.30
Organism:
Homo sapiens (Human)
Description:
P68431 (aa 1-18)
Residue:
18
MARTKQTARKSTGGKAPR