Target
Retinoic acid receptor gamma [183-417]
Ligand
BDBM31887
Substrate
BDBM31883
Meas. Tech.
Retinoid Competition Binding Assay
pH
7.9±n/a
Temperature
277.15±n/a K
Kd
0.6±n/a nM
Citation
 Klaholz, BPMitschler, AMoras, D Structural basis for isotype selectivity of the human retinoic acid nuclear receptor. J Mol Biol 302:155-70 (2000)  
Target
Name:
Retinoic acid receptor gamma [183-417]
Synonyms:
NR1B3 RAR-gamma RARG_HUMAN | Retinoic Acid Receptor, gamma
Type:
Ligand-binding domain
Mol. Mass.:
26502.27
Organism:
Homo sapiens (Human)
Description:
P13631[183-417]
Residue:
235
  
Inhibitor
Name:
BDBM31887
Synonyms:
BMS181156 | Ch 80
Type:
Small organic molecule
Emp. Form.:
C24H26O3
Mol. Mass.:
362.4614
SMILES:
CC1(C)CCC(C)(C)c2cc(ccc12)C(=O)\C=C\c1ccc(cc1)C(O)=O
:
Substrate
Name:
BDBM31883
Synonyms:
9-cis-retinoic acid (9cRA) AT-RA CHEMBL38 SMR000058245 Vitamin A acid [3H]Retinoic acid [3H]tretinoin cid_444795
Type:
radiolabeled ligand
Emp. Form.:
C20H28O2
Mol. Mass.:
300.4351
SMILES:
C\C(\C=C\C1=C(C)CCCC1(C)C)=C/C=C/C(/C)=C/C(O)=O
: