Target
Retinoic acid receptor beta [200-419]
Ligand
BDBM31885
Substrate
BDBM31883
Meas. Tech.
Retinoid Competition Binding Assay
pH
7.9±n/a
Temperature
277.15±n/a K
Kd
679±n/a nM
Citation
 Klaholz, BPMitschler, AMoras, D Structural basis for isotype selectivity of the human retinoic acid nuclear receptor. J Mol Biol 302:155-70 (2000)  
Target
Name:
Retinoic acid receptor beta [200-419]
Synonyms:
HAP Nuclear receptor subfamily 1 group B member 2 RAR-epsilon RARB_HUMAN | Retinoic Acid Receptor, beta
Type:
Ligand-binding domain
Mol. Mass.:
24708.23
Organism:
Homo sapiens (Human)
Description:
P10826[200-419]
Residue:
220
  
Inhibitor
Name:
BDBM31885
Synonyms:
BMS184394 | CHEMBL82089
Type:
Small organic molecule
Emp. Form.:
C26H28O3
Mol. Mass.:
388.4987
SMILES:
CC1(C)CCC(C)(C)c2cc(ccc12)C(O)c1ccc2cc(ccc2c1)C(O)=O
:
Substrate
Name:
BDBM31883
Synonyms:
9-cis-retinoic acid (9cRA) AT-RA CHEMBL38 SMR000058245 Vitamin A acid [3H]Retinoic acid [3H]tretinoin cid_444795
Type:
radiolabeled ligand
Emp. Form.:
C20H28O2
Mol. Mass.:
300.4351
SMILES:
C\C(\C=C\C1=C(C)CCCC1(C)C)=C/C=C/C(/C)=C/C(O)=O
: