Target
cAMP and cAMP-inhibited cGMP 3',5'-cyclic phosphodiesterase 10A
Ligand
BDBM397952
Substrate
Meas. Tech.
Pharmacology Assay
IC50
>500±n/a nM
Citation
 Campbell, JEJones, PGMalcolm, S Substituted [1,2,4]triazolo[1,5-a]pyrazines as phosphodiesterase inhibitors US Patent  US9994590 Publication Date 6/12/2018 
Target
Name:
cAMP and cAMP-inhibited cGMP 3',5'-cyclic phosphodiesterase 10A
Synonyms:
3',5'-cyclic phosphodiesterase PDE10_HUMAN Phosphodiesterase 10A
Type:
Protein
Mol. Mass.:
88412.52
Organism:
Homo sapiens (Human)
Description:
Q9Y233
Residue:
779
  
Inhibitor
Name:
BDBM397952
Synonyms:
US10604536, Compound 58 | US9994590, Compound 24
Type:
Small organic molecule
Emp. Form.:
C18H14ClFN4
Mol. Mass.:
340.782
SMILES:
Fc1ccn2cc(nc2c1)C1CCC1c1cn2cccc(Cl)c2n1
: