Target
cAMP and cAMP-inhibited cGMP 3',5'-cyclic phosphodiesterase 10A
Ligand
BDBM397979
Substrate
Meas. Tech.
Pharmacology Assay
IC50
55±n/a nM
Citation
 Campbell, JEJones, PGMalcolm, S Substituted [1,2,4]triazolo[1,5-a]pyrazines as phosphodiesterase inhibitors US Patent  US9994590 Publication Date 6/12/2018 
Target
Name:
cAMP and cAMP-inhibited cGMP 3',5'-cyclic phosphodiesterase 10A
Synonyms:
3',5'-cyclic phosphodiesterase PDE10A Phosphodiesterase 10 (PDE10) | Phosphodiesterase 10A
Type:
Protein
Mol. Mass.:
88412.52
Organism:
Homo sapiens (Human)
Description:
Q9Y233
Residue:
1055
  
Inhibitor
Name:
BDBM397979
Synonyms:
US10604536, Compound 52 | US9994590, Compound 51
Type:
Small organic molecule
Emp. Form.:
C20H20N6
Mol. Mass.:
344.413
SMILES:
[H][C@]1(C[C@@]1([H])c1nc(cn1C)-c1ccccc1)c1nc2c(C)ncc(C)n2n1
: